Information card for entry 7710720
Chemical name |
CUST-711 |
Formula |
C35 H67 Cu N14 O29 S |
Calculated formula |
C35 H46 Cu N14 O19 S |
Title of publication |
Three layered cucurbit[6]uril-based metal-organic rotaxane networks functionalized by sulfonic groups for proton conduction |
Authors of publication |
Li, Ying; Xu, Yan-Jun; Fan, Ming-Yue; Feng, Zhen-Jie; Li, Jun-Jun; Wu, Xue-Song; Sun, Jing; Wang, Xinlong; Su, Zhong-Min |
Journal of publication |
Dalton Transactions |
Year of publication |
2022 |
a |
16.056 ± 0.0015 Å |
b |
19.139 ± 0.0018 Å |
c |
18.0435 ± 0.0017 Å |
α |
90° |
β |
102.123 ± 0.005° |
γ |
90° |
Cell volume |
5421 ± 0.9 Å3 |
Cell temperature |
295.21 K |
Ambient diffraction temperature |
295.21 K |
Number of distinct elements |
6 |
Space group number |
14 |
Hermann-Mauguin space group symbol |
P 1 21/n 1 |
Hall space group symbol |
-P 2yn |
Residual factor for all reflections |
0.0652 |
Residual factor for significantly intense reflections |
0.0482 |
Weighted residual factors for significantly intense reflections |
0.1276 |
Weighted residual factors for all reflections included in the refinement |
0.1377 |
Goodness-of-fit parameter for all reflections included in the refinement |
1.038 |
Diffraction radiation wavelength |
1.54178 Å |
Diffraction radiation type |
CuKα |
Yes |
No |
No |