Information card for entry 7710797
Formula | C18 H25 Cl2 Cu N5 O13 |
Calculated formula | C18 H25 Cl2 Cu N5 O13 |
SMILES | [Cu]123([n]4oc(cc4N[C@@H](OC)c4[n]1c(ccc4)[C@H]([O]2C)Nc1[n]3oc(C)c1)C)[OH]C.Cl(=O)(=O)(=O)[O-].Cl(=O)(=O)(=O)[O-].[Cu]123([n]4oc(cc4N[C@H](OC)c4[n]1c(ccc4)[C@@H]([O]2C)Nc1[n]3oc(C)c1)C)[OH]C.Cl(=O)(=O)(=O)[O-].Cl(=O)(=O)(=O)[O-] |
Title of publication | Understanding the effect of structural changes on slow magnetic relaxation in mononuclear octahedral copper(ii) complexes |
Authors of publication | Marcinkowski, Dawid; Adamski, Ariel; Kubicki, Maciej; Consiglio, Giuseppe; Patroniak, Violetta; Ślusarski, Tomasz; Açıkgöz, Muhammed; Szeliga, Daria; Vadra, Nahir; Karbowiak, Mirosław; Stefaniuk, Ireneusz; Rudowicz, Czesław; Gorczyński, Adam; Korabik, Maria |
Journal of publication | Dalton Transactions |
Year of publication | 2022 |
a | 9.7716 ± 0.0004 Å |
b | 11.9652 ± 0.0004 Å |
c | 12.293 ± 0.0006 Å |
α | 80.798 ± 0.003° |
β | 68.698 ± 0.004° |
γ | 84.505 ± 0.003° |
Cell volume | 1320.75 ± 0.1 Å3 |
Cell temperature | 295 ± 2 K |
Ambient diffraction temperature | 295 ± 2 K |
Number of distinct elements | 6 |
Space group number | 2 |
Hermann-Mauguin space group symbol | P -1 |
Hall space group symbol | -P 1 |
Residual factor for all reflections | 0.1377 |
Residual factor for significantly intense reflections | 0.1325 |
Weighted residual factors for significantly intense reflections | 0.3081 |
Weighted residual factors for all reflections included in the refinement | 0.3104 |
Goodness-of-fit parameter for all reflections included in the refinement | 1.046 |
Diffraction radiation probe | x-ray |
Diffraction radiation wavelength | 0.71073 Å |
Diffraction radiation type | MoKα |