Information card for entry 7710854
Formula | C23 H28 Br2 F3 Fe N4 O5 S |
Calculated formula | C23 H28 Br2 F3 Fe N4 O5 S |
SMILES | Brc1ccc2O[Fe]345(Oc6ccc(Br)cc6C=[N]4CC[NH]5CC)[N](=Cc2c1)CC[NH]3CC.S(=O)(=O)([O-])C(F)(F)F |
Title of publication | The strong correlations between thermal conductivities and electronic spin states in crystals of Fe(III) spin crossover complexes |
Authors of publication | Hoshino, Norihisa; Hayashi, Akari; Akutagawa, Tomoyuki |
Journal of publication | Dalton Transactions |
Year of publication | 2022 |
a | 9.5228 ± 0.0004 Å |
b | 24.5067 ± 0.0011 Å |
c | 12.6996 ± 0.0006 Å |
α | 90° |
β | 106.982 ± 0.008° |
γ | 90° |
Cell volume | 2834.5 ± 0.3 Å3 |
Cell temperature | 254 ± 2 K |
Ambient diffraction temperature | 254 ± 2 K |
Number of distinct elements | 8 |
Space group number | 14 |
Hermann-Mauguin space group symbol | P 1 21/c 1 |
Hall space group symbol | -P 2ybc |
Residual factor for all reflections | 0.1232 |
Residual factor for significantly intense reflections | 0.0616 |
Weighted residual factors for significantly intense reflections | 0.1242 |
Weighted residual factors for all reflections included in the refinement | 0.1498 |
Goodness-of-fit parameter for all reflections included in the refinement | 0.982 |
Diffraction radiation wavelength | 1.54187 Å |
Diffraction radiation type | CuKα |