Information card for entry 7710884
Formula | C42 H48 Ag6 N6 Se6 |
Calculated formula | C42 H48 Ag6 N6 Se6 |
Title of publication | Facile One Pot Synthesis of Highly Photoresponsive Coinage Metal Selenides (Cu1.8Se and Ag2Se) Achieved Through Novel Cu and Ag Pyridylselenolates as Molecular Precursors |
Authors of publication | Karmakar, Gourab; Tyagi, Adish; Shah, Alpa Y.; Nigam, Sandeep; Wadawale, Amey; Gotluru, Kedarnath; Vats, Bal Govind; Kumar, N. Naveen; Singh, Vishal |
Journal of publication | Dalton Transactions |
Year of publication | 2022 |
a | 12.1492 ± 0.0004 Å |
b | 16.0365 ± 0.0005 Å |
c | 13.0874 ± 0.0005 Å |
α | 90° |
β | 101.103 ± 0.003° |
γ | 90° |
Cell volume | 2502.1 ± 0.15 Å3 |
Cell temperature | 100 ± 2 K |
Ambient diffraction temperature | 100 ± 2 K |
Number of distinct elements | 5 |
Space group number | 14 |
Hermann-Mauguin space group symbol | P 1 21/n 1 |
Hall space group symbol | -P 2yn |
Residual factor for all reflections | 0.0499 |
Residual factor for significantly intense reflections | 0.0318 |
Weighted residual factors for significantly intense reflections | 0.0681 |
Weighted residual factors for all reflections included in the refinement | 0.0731 |
Goodness-of-fit parameter for all reflections included in the refinement | 1.032 |
Diffraction radiation probe | x-ray |
Diffraction radiation wavelength | 0.71073 Å |
Diffraction radiation type | MoKα |