Information card for entry 7710991
Formula | C30 H28 N2 O4 S4 |
Calculated formula | C30 H28 N2 O4 S4 |
Title of publication | Diaryl dithiocarbamates: synthesis, oxidation to thiuram disulfides, Co(iii) complexes [Co(S2CNAr2)3] and their use as single source precursors to CoS2 |
Authors of publication | Sarker, Jagodish C.; Nash, Rosie; Boonrungsiman, Suwimon; Pugh, David; Hogarth, Graeme |
Journal of publication | Dalton Transactions |
Year of publication | 2022 |
a | 8.574 ± 0.0006 Å |
b | 9.6486 ± 0.0006 Å |
c | 11.136 ± 0.0005 Å |
α | 68.656 ± 0.005° |
β | 89.217 ± 0.005° |
γ | 64.833 ± 0.006° |
Cell volume | 765.65 ± 0.1 Å3 |
Cell temperature | 100 ± 2 K |
Ambient diffraction temperature | 100 ± 0.1 K |
Number of distinct elements | 5 |
Space group number | 2 |
Hermann-Mauguin space group symbol | P -1 |
Hall space group symbol | -P 1 |
Residual factor for all reflections | 0.0498 |
Residual factor for significantly intense reflections | 0.0465 |
Weighted residual factors for significantly intense reflections | 0.1252 |
Weighted residual factors for all reflections included in the refinement | 0.1287 |
Goodness-of-fit parameter for all reflections included in the refinement | 1.037 |
Diffraction radiation probe | x-ray |
Diffraction radiation wavelength | 0.71075 Å |
Diffraction radiation type | MoKα |