Information card for entry 7711056
Formula | C27 H26 F12 N3 P2 Ru |
Calculated formula | C27 H26 F12 N3 P2 Ru |
Title of publication | Synthesis, characterization, interactions with the DNA duplex dodecamer d(5΄-CGCGAATTCGCG-3΄)2 and cytotoxicity of binuclear η6-arene-Ru(II) complexes. |
Authors of publication | Georgakopoulou, Christina; Thomos, Dimitrios; Tsolis, Theodoros; Ypsilantis, Konstantinos; Plakatouras, John C.; Kordias, Dimitris; Magklara, Angeliki; Kouderis, Constantine; Kalampounias, Angelos G.; Garoufis, Achilleas |
Journal of publication | Dalton Transactions |
Year of publication | 2022 |
a | 13.1201 ± 0.0005 Å |
b | 13.8478 ± 0.0005 Å |
c | 19.2251 ± 0.0007 Å |
α | 92.147 ± 0.002° |
β | 97.737 ± 0.002° |
γ | 96.195 ± 0.002° |
Cell volume | 3436.1 ± 0.2 Å3 |
Cell temperature | 296 ± 2 K |
Ambient diffraction temperature | 296 ± 2 K |
Number of distinct elements | 6 |
Space group number | 2 |
Hermann-Mauguin space group symbol | P -1 |
Hall space group symbol | -P 1 |
Residual factor for all reflections | 0.1029 |
Residual factor for significantly intense reflections | 0.0566 |
Weighted residual factors for significantly intense reflections | 0.1502 |
Weighted residual factors for all reflections included in the refinement | 0.1697 |
Goodness-of-fit parameter for all reflections included in the refinement | 1.029 |
Diffraction radiation wavelength | 0.71073 Å |
Diffraction radiation type | MoKα |