Information card for entry 7711115
Formula | C6 H14 Eu N7 O10 |
Calculated formula | C6 H14 Eu N7 O10 |
SMILES | [Eu]1(OC2=[N]1C1=NC([O-])=NC3N1C(=N2)N=C([O-])N=3)([OH2])([OH2])([OH2])([OH2])([OH2])([OH2])[OH2] |
Title of publication | S-Heptazine N-Ligand Based Luminescent Coordination Materials: Synthesis, Structural and Luminescent Studies of Lanthanide-Cyamelurate Networks |
Authors of publication | Essalhi, Mohamed; Mohan, Midhun; Marineau-Plante, Gabriel; Schlachter, Adrien Camille; Maris, Thierry; Harvey, Pierre D.; Duong, Adam |
Journal of publication | Dalton Transactions |
Year of publication | 2022 |
a | 11.8872 ± 0.0006 Å |
b | 6.8605 ± 0.0003 Å |
c | 16.7718 ± 0.0008 Å |
α | 90° |
β | 93.608 ± 0.002° |
γ | 90° |
Cell volume | 1365.07 ± 0.11 Å3 |
Cell temperature | 295 K |
Ambient diffraction temperature | 295 K |
Number of distinct elements | 5 |
Space group number | 14 |
Hermann-Mauguin space group symbol | P 1 21/n 1 |
Hall space group symbol | -P 2yn |
Residual factor for all reflections | 0.0339 |
Residual factor for significantly intense reflections | 0.0331 |
Weighted residual factors for significantly intense reflections | 0.0769 |
Weighted residual factors for all reflections included in the refinement | 0.0774 |
Goodness-of-fit parameter for all reflections included in the refinement | 1.065 |
Diffraction radiation wavelength | 1.54178 Å |
Diffraction radiation type | CuKα |