Information card for entry 7711131
Chemical name | 10 |
Formula | C24 H22 Cl4 Eu N9 |
Calculated formula | C24 H22 Cl4 Eu N9 |
SMILES | [Eu](Cl)(Cl)(Cl)(Cl)([n]1cc(ccc1)c1n[nH]cc1)[n]1cc(ccc1)c1n[nH]cc1.[nH+]1cc(ccc1)c1n[nH]cc1 |
Title of publication | 3D-Frameworks and 2D-Networks of Lanthanide Coordination Polymers with 3-Pyridylpyrazole: Photophysical and Magnetic Properties |
Authors of publication | Youssef, Heba; Schäfer, Thomas C.; Becker, Jonathan; Sedykh, Alexander E.; Basso, Leonardo; Pietzonka, Clemens; Taydakov, Ilya V.; Kraus, Florian; Müller-Buschbaum, Klaus |
Journal of publication | Dalton Transactions |
Year of publication | 2022 |
a | 12.5262 ± 0.0004 Å |
b | 13.7731 ± 0.0005 Å |
c | 15.9769 ± 0.0006 Å |
α | 90° |
β | 96.969 ± 0.002° |
γ | 90° |
Cell volume | 2736.04 ± 0.17 Å3 |
Cell temperature | 100 ± 2 K |
Ambient diffraction temperature | 100 ± 2 K |
Number of distinct elements | 5 |
Space group number | 14 |
Hermann-Mauguin space group symbol | P 1 21/c 1 |
Hall space group symbol | -P 2ybc |
Residual factor for all reflections | 0.0862 |
Residual factor for significantly intense reflections | 0.0418 |
Weighted residual factors for significantly intense reflections | 0.0703 |
Weighted residual factors for all reflections included in the refinement | 0.0812 |
Goodness-of-fit parameter for all reflections included in the refinement | 1.001 |
Diffraction radiation wavelength | 0.71073 Å |
Diffraction radiation type | MoKα |