Information card for entry 7711151
Formula | C24 H20 I3 N3 O7 |
Calculated formula | C24 H20 I3 N3 O7 |
SMILES | [I](OC(=O)c1cc(cc(c1)C(=O)O[I][n]1ccccc1)C(=O)O[I][n]1ccccc1)[n]1ccccc1.O |
Title of publication | Carbonyl Hypoiodites from Pivalic and Trimesic Acid and their Silver(I) Intermediates |
Authors of publication | Ward, Jas S.; Martõnova, Jevgenija; Wilson, Laura M. E.; Kramer, Eric; Aav, Riina; Rissanen, Kari |
Journal of publication | Dalton Transactions |
Year of publication | 2022 |
a | 9.7621 ± 0.0002 Å |
b | 24.2101 ± 0.0005 Å |
c | 11.4785 ± 0.0002 Å |
α | 90° |
β | 91.437 ± 0.002° |
γ | 90° |
Cell volume | 2711.99 ± 0.09 Å3 |
Cell temperature | 120.01 ± 0.1 K |
Ambient diffraction temperature | 120.01 ± 0.1 K |
Number of distinct elements | 5 |
Space group number | 14 |
Hermann-Mauguin space group symbol | P 1 21/n 1 |
Hall space group symbol | -P 2yn |
Residual factor for all reflections | 0.0328 |
Residual factor for significantly intense reflections | 0.026 |
Weighted residual factors for significantly intense reflections | 0.0622 |
Weighted residual factors for all reflections included in the refinement | 0.0662 |
Goodness-of-fit parameter for all reflections included in the refinement | 1.008 |
Diffraction radiation probe | x-ray |
Diffraction radiation wavelength | 1.54184 Å |
Diffraction radiation type | CuKα |