Information card for entry 7711234
Formula | C38 H47 As N2 O4 |
Calculated formula | C38 H47 As N2 O4 |
Title of publication | Beyond simple hetero Diels-Alder Cycloadditions. A New Type of Element-Ligand Cooperativity at N,C,N-coordinated Arsinidene and Stibinidene Centres in the Reaction with an Electron Deficient Alkyne. |
Authors of publication | Hejda, Martin; Zechovský, Jan; Kremláček, Vít; Erben, Milan; Rychagova, Elena A.; Jambor, Roman; R°užička, Aleš; Ketkov, Sergey Yu.; Dostál, Libor |
Journal of publication | Dalton Transactions |
Year of publication | 2022 |
a | 30.1953 ± 0.0013 Å |
b | 10.8768 ± 0.0005 Å |
c | 25.0422 ± 0.0016 Å |
α | 90° |
β | 123.443 ± 0.001° |
γ | 90° |
Cell volume | 6862.9 ± 0.6 Å3 |
Cell temperature | 150 ± 2 K |
Ambient diffraction temperature | 150 ± 2 K |
Number of distinct elements | 5 |
Space group number | 15 |
Hermann-Mauguin space group symbol | C 1 2/c 1 |
Hall space group symbol | -C 2yc |
Residual factor for all reflections | 0.0638 |
Residual factor for significantly intense reflections | 0.0411 |
Weighted residual factors for significantly intense reflections | 0.0779 |
Weighted residual factors for all reflections included in the refinement | 0.0855 |
Goodness-of-fit parameter for all reflections included in the refinement | 1.028 |
Diffraction radiation wavelength | 0.71073 Å |
Diffraction radiation type | MoKα |