Information card for entry 7711236
Formula | C38 H47 N2 O4 Sb |
Calculated formula | C38 H47 N2 O4 Sb |
Title of publication | Beyond simple hetero Diels-Alder Cycloadditions. A New Type of Element-Ligand Cooperativity at N,C,N-coordinated Arsinidene and Stibinidene Centres in the Reaction with an Electron Deficient Alkyne. |
Authors of publication | Hejda, Martin; Zechovský, Jan; Kremláček, Vít; Erben, Milan; Rychagova, Elena A.; Jambor, Roman; R°užička, Aleš; Ketkov, Sergey Yu.; Dostál, Libor |
Journal of publication | Dalton Transactions |
Year of publication | 2022 |
a | 9.8206 ± 0.0004 Å |
b | 10.014 ± 0.0004 Å |
c | 19.3579 ± 0.0006 Å |
α | 91.373 ± 0.002° |
β | 103.932 ± 0.002° |
γ | 104.657 ± 0.002° |
Cell volume | 1780.27 ± 0.12 Å3 |
Cell temperature | 150 ± 2 K |
Ambient diffraction temperature | 150 ± 2 K |
Number of distinct elements | 5 |
Space group number | 2 |
Hermann-Mauguin space group symbol | P -1 |
Hall space group symbol | -P 1 |
Residual factor for all reflections | 0.0399 |
Residual factor for significantly intense reflections | 0.0329 |
Weighted residual factors for significantly intense reflections | 0.0746 |
Weighted residual factors for all reflections included in the refinement | 0.0771 |
Goodness-of-fit parameter for all reflections included in the refinement | 1.085 |
Diffraction radiation wavelength | 0.71073 Å |
Diffraction radiation type | MoKα |