Information card for entry 7711264
Formula |
C52.5 H71.5 La N9.5 O23.5 |
Calculated formula |
C36 H27 La N4 O15 |
Title of publication |
A series of naphthalenediimide-based metal−organic frameworks: synthesis, photochromism and inkless and erasable printing |
Authors of publication |
Zhong, Xiao-Feng; Luo, Guo-Jun; Li, Wen-Bin; Chen, Xiong-Hai; Wu, Ying; Chen, Yi-Hui; Ye, Jia-Wen; Bai, Jie; Mo, Zong-Wen; Chen, Xiao-Ming |
Journal of publication |
Dalton Transactions |
Year of publication |
2022 |
a |
35.8643 ± 0.0009 Å |
b |
22.9736 ± 0.0011 Å |
c |
17.0163 ± 0.0006 Å |
α |
90° |
β |
92.965 ± 0.003° |
γ |
90° |
Cell volume |
14001.5 ± 0.9 Å3 |
Cell temperature |
298 ± 2 K |
Ambient diffraction temperature |
298 ± 2 K |
Number of distinct elements |
5 |
Space group number |
15 |
Hermann-Mauguin space group symbol |
C 1 2/c 1 |
Hall space group symbol |
-C 2yc |
Residual factor for all reflections |
0.0952 |
Residual factor for significantly intense reflections |
0.0771 |
Weighted residual factors for significantly intense reflections |
0.2119 |
Weighted residual factors for all reflections included in the refinement |
0.2292 |
Goodness-of-fit parameter for all reflections included in the refinement |
0.957 |
Diffraction radiation wavelength |
1.54184 Å |
Diffraction radiation type |
CuKα |
Yes |
No |
No |