Information card for entry 7711295
Formula |
C16 H20 Cl6 Mn N2 |
Calculated formula |
C16 H22 Cl6 Mn N2 |
Title of publication |
Metal ion induced dual switchable dielectric and luminescent properties in hybrid halides |
Authors of publication |
Liu, Jia; Han, Li-Jun; Shao, Ting; Su, Chang-Yuan; Chen, Ming; Huang, Pei-Zhi; Jia, Qiang-Qiang; Fu, Da-Wei; Lu, Hai-Feng |
Journal of publication |
Dalton Transactions |
Year of publication |
2022 |
a |
7.5849 ± 0.0013 Å |
b |
7.7567 ± 0.0016 Å |
c |
21.082 ± 0.004 Å |
α |
94.064 ± 0.005° |
β |
94.901 ± 0.004° |
γ |
110.014 ± 0.004° |
Cell volume |
1154.5 ± 0.4 Å3 |
Cell temperature |
365 ± 2 K |
Ambient diffraction temperature |
365 ± 2 K |
Number of distinct elements |
5 |
Space group number |
2 |
Hermann-Mauguin space group symbol |
P -1 |
Hall space group symbol |
-P 1 |
Residual factor for all reflections |
0.0885 |
Residual factor for significantly intense reflections |
0.0462 |
Weighted residual factors for significantly intense reflections |
0.109 |
Weighted residual factors for all reflections included in the refinement |
0.1331 |
Goodness-of-fit parameter for all reflections included in the refinement |
1.052 |
Diffraction radiation wavelength |
0.71073 Å |
Diffraction radiation type |
MoKα |
Yes |
Yes |
No |