Information card for entry 7711311
Formula |
C24 H14 N4 |
Calculated formula |
C24 H14 N4 |
Title of publication |
Insights into the different mechanistic stages of light-induced hydrogen evolution of a 5,5′-bisphenanthroline linked RuPt complex |
Authors of publication |
Lämmle, Martin; Pilz, T. David; Kutta, Roger Jan; Müßler, Marius; Mengele, Alexander K.; Görls, Helmar; Heinemann, Frank W.; Rau, Sven |
Journal of publication |
Dalton Transactions |
Year of publication |
2022 |
a |
16.9786 ± 0.0014 Å |
b |
11.1129 ± 0.0009 Å |
c |
11.8836 ± 0.0008 Å |
α |
90° |
β |
121.353 ± 0.004° |
γ |
90° |
Cell volume |
1914.8 ± 0.3 Å3 |
Cell temperature |
183 ± 2 K |
Ambient diffraction temperature |
183 ± 2 K |
Number of distinct elements |
3 |
Space group number |
15 |
Hermann-Mauguin space group symbol |
C 1 2/c 1 |
Hall space group symbol |
-C 2yc |
Residual factor for all reflections |
0.0887 |
Residual factor for significantly intense reflections |
0.0698 |
Weighted residual factors for significantly intense reflections |
0.2275 |
Weighted residual factors for all reflections included in the refinement |
0.2441 |
Goodness-of-fit parameter for all reflections included in the refinement |
1.045 |
Diffraction radiation wavelength |
0.71073 Å |
Diffraction radiation type |
MoKα |
Yes |
No |
No |