Information card for entry 7711450
Formula | C30 H64 Cl3 Co2 N6 O24 Tb |
Calculated formula | C30 H64 Cl3 Co2 N6 O24 Tb |
Title of publication | Structural evolution from preorganized mononuclear triazamacrocyclic metalloligands to polynuclear metallocages and heterometallic 2D layers: modular architectures, assembly tracking and magnetic properties |
Authors of publication | Lan, Bi-Liu; Luo, Ai-Yi; Shao, Bing; Gao, Li-Na; Wei, Qin; Liang, Yu-Ning; Huang, Jin; Zhang, Zhong |
Journal of publication | Dalton Transactions |
Year of publication | 2022 |
a | 9.0019 ± 0.0013 Å |
b | 9.0019 ± 0.0013 Å |
c | 30.036 ± 0.005 Å |
α | 90° |
β | 90° |
γ | 120° |
Cell volume | 2107.9 ± 0.6 Å3 |
Cell temperature | 296 ± 2 K |
Ambient diffraction temperature | 296 ± 2 K |
Number of distinct elements | 7 |
Space group number | 194 |
Hermann-Mauguin space group symbol | P 63/m m c |
Hall space group symbol | -P 6c 2c |
Residual factor for all reflections | 0.0715 |
Residual factor for significantly intense reflections | 0.0688 |
Weighted residual factors for significantly intense reflections | 0.1809 |
Weighted residual factors for all reflections included in the refinement | 0.1819 |
Goodness-of-fit parameter for all reflections included in the refinement | 1.032 |
Diffraction radiation wavelength | 0.71073 Å |
Diffraction radiation type | MoKα |