Information card for entry 7711488
Formula | C34.51 H41.03 Co N4 O2.17 |
Calculated formula | C34.513 H41.026 Co N4 O2.171 |
Title of publication | Magnetically bistable cobalt-dioxolene complexes with tetradentate N-donor base |
Authors of publication | Chegerev, Maxim; Korchagin, Denis V.; Shilov, Gennady V.; Efimov, N. N.; Starikov, Andrey; Piskunov, Alexandr Vladimirovich; Chernyshev, Anatoly V.; Bulgakov, Alexei; Minkin, Vladimir I.; Palii, Andrei; Aldoshin, Sergey M. |
Journal of publication | Dalton Transactions |
Year of publication | 2022 |
a | 10.9948 ± 0.0003 Å |
b | 11.5726 ± 0.0004 Å |
c | 14.2748 ± 0.0004 Å |
α | 93.787 ± 0.003° |
β | 90.104 ± 0.003° |
γ | 111.805 ± 0.003° |
Cell volume | 1681.99 ± 0.09 Å3 |
Cell temperature | 100 ± 1 K |
Ambient diffraction temperature | 100 ± 1 K |
Number of distinct elements | 5 |
Space group number | 2 |
Hermann-Mauguin space group symbol | P -1 |
Hall space group symbol | -P 1 |
Residual factor for all reflections | 0.0734 |
Residual factor for significantly intense reflections | 0.0548 |
Weighted residual factors for significantly intense reflections | 0.1395 |
Weighted residual factors for all reflections included in the refinement | 0.1539 |
Goodness-of-fit parameter for all reflections included in the refinement | 1.04 |
Diffraction radiation wavelength | 0.7107 Å |
Diffraction radiation type | MoKα |