Information card for entry 7711502
Formula | C31 H31 Cu F6 N O3 S6 |
Calculated formula | C31 H32 Cu F6 N3 O3 S6 |
Title of publication | Modulation of the magnetic and photophysical properties in 3d–4f and 4f–4f′ heterobimetallic complexes involving a tetrathiafulvalene-based ligand |
Authors of publication | Douib, Haiet; Flores Gonzalez, Jessica; Speed, Saskia; Montigaud, Vincent; Lefeuvre, Bertrand; Dorcet, Vincent; Riobé, François; Maury, Olivier; Gouasmia, Abdelkrim; Le Guennic, Boris; Cador, Olivier; Pointillart, Fabrice |
Journal of publication | Dalton Transactions |
Year of publication | 2022 |
a | 9.7341 ± 0.0018 Å |
b | 13.82 ± 0.003 Å |
c | 15.588 ± 0.003 Å |
α | 113.594 ± 0.006° |
β | 107.762 ± 0.006° |
γ | 93.416 ± 0.006° |
Cell volume | 1790 ± 0.6 Å3 |
Cell temperature | 150 K |
Ambient diffraction temperature | 150 K |
Number of distinct elements | 7 |
Space group number | 2 |
Hermann-Mauguin space group symbol | P -1 |
Hall space group symbol | -P 1 |
Residual factor for all reflections | 0.1258 |
Residual factor for significantly intense reflections | 0.0707 |
Weighted residual factors for significantly intense reflections | 0.1821 |
Weighted residual factors for all reflections included in the refinement | 0.2126 |
Goodness-of-fit parameter for all reflections included in the refinement | 1.028 |
Diffraction radiation probe | x-ray |
Diffraction radiation wavelength | 0.71073 Å |
Diffraction radiation type | MoKα |