Information card for entry 7711576
Common name | borataphenanthrene W(CO)3 complex |
Formula | C46 H48 B Cl2 K O9 Si W |
Calculated formula | C46 H48 B Cl2 K O9 Si W |
SMILES | [K]12345([O]#C[W]6789%10([B]%11(C%10([Si](C)(C)C)[c]%106cccc[c]7%10[c]86cccc[c]96%11)c6ccccc6)(C#[O])C#[O])[O]6c7ccccc7[O]1CC[O]2CC[O]3c1ccccc1[O]4CC[O]5CC6.ClCCl |
Title of publication | Assessing the Donor Ability of Boratabenzene and 9-Borataphenanthrene Anions through Metal Complexes with Carbonyl Ligands |
Authors of publication | Rojales, Katherine; Masilamani, Tamizmani; Bartholome, Tyler A.; Martin, Caleb Daniel |
Journal of publication | Dalton Transactions |
Year of publication | 2022 |
a | 14.3661 ± 0.0004 Å |
b | 32.3267 ± 0.0008 Å |
c | 9.8108 ± 0.0002 Å |
α | 90° |
β | 102.329 ± 0.001° |
γ | 90° |
Cell volume | 4451.14 ± 0.19 Å3 |
Cell temperature | 150 ± 2 K |
Ambient diffraction temperature | 150 ± 2 K |
Number of distinct elements | 8 |
Space group number | 9 |
Hermann-Mauguin space group symbol | C 1 c 1 |
Hall space group symbol | C -2yc |
Residual factor for all reflections | 0.0268 |
Residual factor for significantly intense reflections | 0.0248 |
Weighted residual factors for significantly intense reflections | 0.0706 |
Weighted residual factors for all reflections included in the refinement | 0.0714 |
Goodness-of-fit parameter for all reflections included in the refinement | 1.186 |
Diffraction radiation wavelength | 0.71073 Å |
Diffraction radiation type | MoKα |