Information card for entry 7712087
Formula | C44 H24 Cl4 Cu F2 N4 O2 |
Calculated formula | C44 H24 Cl4 Cu F2 N4 O2 |
Title of publication | Copper(II) complex enhanced chemodynamic therapy through GSH depletion and autophagy flow blockade |
Authors of publication | Shen, Wen-Ying; Jia, Chun-Peng; Liao, Li-Yi; Chen, Liu-Lin; Yuan, Chen-Cheng; Gu, Yunqiong; Liu, Yang-Han; Liang, Hong; Chen, Zhen-Feng |
Journal of publication | Dalton Transactions |
Year of publication | 2023 |
a | 19.6802 ± 0.0006 Å |
b | 9.9152 ± 0.0002 Å |
c | 20.2125 ± 0.0006 Å |
α | 90° |
β | 94.951 ± 0.003° |
γ | 90° |
Cell volume | 3929.41 ± 0.19 Å3 |
Cell temperature | 293 ± 2 K |
Ambient diffraction temperature | 293 ± 2 K |
Number of distinct elements | 7 |
Space group number | 15 |
Hermann-Mauguin space group symbol | C 1 2/c 1 |
Hall space group symbol | -C 2yc |
Residual factor for all reflections | 0.0512 |
Residual factor for significantly intense reflections | 0.0372 |
Weighted residual factors for significantly intense reflections | 0.0899 |
Weighted residual factors for all reflections included in the refinement | 0.0999 |
Goodness-of-fit parameter for all reflections included in the refinement | 1.047 |
Diffraction radiation probe | x-ray |
Diffraction radiation wavelength | 0.71073 Å |
Diffraction radiation type | MoKα |