Information card for entry 7712423
Chemical name | (CAAI)BCl2 |
Formula | C20 H31 B Cl2 N2 |
Calculated formula | C20 H31 B Cl2 N2 |
Title of publication | Cyclic Alkyl(amino)iminates (CAAIs) as Strong 2σ,4π-Electron Donor Ligands for the Stabilisation of Boranes and Diboranes(4): A Synthetic and Computational Study |
Authors of publication | Huynh, Silvia; Arrowsmith, Merle; Meier, Lukas; Dietz, Maximilian; Härterich, Marcel; Michel, Maximilian; Gärtner, Annalena; Braunschweig, Holger |
Journal of publication | Dalton Transactions |
Year of publication | 2023 |
a | 14.27 ± 0.006 Å |
b | 10.149 ± 0.004 Å |
c | 14.806 ± 0.006 Å |
α | 90° |
β | 97.11 ± 0.02° |
γ | 90° |
Cell volume | 2127.8 ± 1.5 Å3 |
Cell temperature | 100 ± 2 K |
Ambient diffraction temperature | 100 ± 2 K |
Number of distinct elements | 5 |
Space group number | 14 |
Hermann-Mauguin space group symbol | P 1 21/n 1 |
Hall space group symbol | -P 2yn |
Residual factor for all reflections | 0.0436 |
Residual factor for significantly intense reflections | 0.0375 |
Weighted residual factors for significantly intense reflections | 0.0959 |
Weighted residual factors for all reflections included in the refinement | 0.1004 |
Goodness-of-fit parameter for all reflections included in the refinement | 1.031 |
Diffraction radiation probe | x-ray |
Diffraction radiation wavelength | 0.71073 Å |
Diffraction radiation type | MoKα |
Diffraction radiation X-ray symbol | K-L~2,3~ |