Information card for entry 7712453
Formula | C14 H12 Au2 Fe N8 O2 |
Calculated formula | C14 H12 Au2 Fe N8 O2 |
Title of publication | Guest-triggered "Soma-Iwamoto-type" penetration complex {Fe(4-methoxypyrimidine)<sub>2</sub>[M(CN)<sub>2</sub>]<sub>2</sub>}·Guest (M = Ag, Au). |
Authors of publication | Kitase, Kosuke; Akahoshi, Daisuke; Kitazawa, Takafumi |
Journal of publication | Dalton transactions (Cambridge, England : 2003) |
Year of publication | 2023 |
Journal volume | 52 |
Journal issue | 9 |
Pages of publication | 2571 - 2579 |
a | 7.9892 ± 0.0005 Å |
b | 15.5225 ± 0.0009 Å |
c | 8.7466 ± 0.0005 Å |
α | 90° |
β | 111.496 ± 0.001° |
γ | 90° |
Cell volume | 1009.24 ± 0.1 Å3 |
Cell temperature | 296 ± 2 K |
Ambient diffraction temperature | 296 ± 2 K |
Number of distinct elements | 6 |
Space group number | 14 |
Hermann-Mauguin space group symbol | P 1 21/n 1 |
Hall space group symbol | -P 2yn |
Residual factor for all reflections | 0.0372 |
Residual factor for significantly intense reflections | 0.0263 |
Weighted residual factors for significantly intense reflections | 0.0586 |
Weighted residual factors for all reflections included in the refinement | 0.0621 |
Goodness-of-fit parameter for all reflections included in the refinement | 1.063 |
Diffraction radiation wavelength | 0.71073 Å |
Diffraction radiation type | MoKα |