Information card for entry 7712575
Formula |
C24 H22 N2 O12 P2 Zn2 |
Calculated formula |
C24 H22 N2 O12 P2 Zn2 |
Title of publication |
Post–synthetic functionalization of Zn–CP by Tb3+ ions: ratiometric luminescent sensor for the ultraviolet filter benzophenone |
Authors of publication |
Zhang, Xu; Li, Xin; Ding, Tianyang; Yu, Jiahui; Jiao, Cheng–Qi; Hu, Ye; Zhou, Yanan; Zhu, Yanyu; Sun, Zhen-Gang; Zheng, Hanwen |
Journal of publication |
Dalton Transactions |
Year of publication |
2023 |
a |
8.296 ± 0.0005 Å |
b |
12.6795 ± 0.0008 Å |
c |
13.3039 ± 0.0008 Å |
α |
75.452 ± 0.001° |
β |
85.767 ± 0.001° |
γ |
80.509 ± 0.001° |
Cell volume |
1335.25 ± 0.14 Å3 |
Cell temperature |
296 ± 2 K |
Ambient diffraction temperature |
296 ± 2 K |
Number of distinct elements |
6 |
Space group number |
2 |
Hermann-Mauguin space group symbol |
P -1 |
Hall space group symbol |
-P 1 |
Residual factor for all reflections |
0.0363 |
Residual factor for significantly intense reflections |
0.0273 |
Weighted residual factors for significantly intense reflections |
0.065 |
Weighted residual factors for all reflections included in the refinement |
0.0686 |
Goodness-of-fit parameter for all reflections included in the refinement |
1.045 |
Diffraction radiation wavelength |
0.71073 Å |
Diffraction radiation type |
MoKα |
Yes |
No |
No |