Information card for entry 7712596
Formula | C21 H15 B F N O |
Calculated formula | C21 H15 B F N O |
SMILES | Fc1ccc2O[B]([n]3cccc1c23)(c1ccccc1)c1ccccc1 |
Title of publication | 9-Borafluoren-9-yl and diphenylboron tetracoordinate complexes of F- and Cl-substituted 8-quinolinolato ligands: synthesis, molecular and electronic structures, fluorescence and application in OLED devices |
Authors of publication | Gomes, Pedro T.; Fialho, Carina B.; Cruz, Tiago Carpinteiro; Rodrigues, Ana I.; Calhorda, Maria José; Vieira Ferreira, Luís Filipe Filipe; Pander, Piotr Henryk; Dias, Fernando B.; Morgado, Jorge; Maçanita, António L. |
Journal of publication | Dalton Transactions |
Year of publication | 2023 |
a | 10.8807 ± 0.0006 Å |
b | 28.8313 ± 0.0015 Å |
c | 11.2931 ± 0.0006 Å |
α | 90° |
β | 114.236 ± 0.002° |
γ | 90° |
Cell volume | 3230.5 ± 0.3 Å3 |
Cell temperature | 150 K |
Ambient diffraction temperature | 150 K |
Number of distinct elements | 6 |
Space group number | 14 |
Hermann-Mauguin space group symbol | P 1 21/c 1 |
Hall space group symbol | -P 2ybc |
Residual factor for all reflections | 0.073 |
Residual factor for significantly intense reflections | 0.0606 |
Weighted residual factors for significantly intense reflections | 0.1347 |
Weighted residual factors for all reflections included in the refinement | 0.141 |
Goodness-of-fit parameter for all reflections included in the refinement | 1.122 |
Diffraction radiation wavelength | 0.71073 Å |
Diffraction radiation type | MoKα |