Information card for entry 7712610
Formula | C19 H20 Ag3 I6 N5 O2 |
Calculated formula | C19 H20 Ag3 I6 N5 O2 |
Title of publication | Photocatalytic properties of iodometallates with <i>in situ</i>-generated organic bases as countercations. |
Authors of publication | Leng, Feng; Zhang, Xiao; Yu, Jie-Hui |
Journal of publication | Dalton transactions (Cambridge, England : 2003) |
Year of publication | 2023 |
Journal volume | 52 |
Journal issue | 16 |
Pages of publication | 5127 - 5140 |
a | 11.3448 ± 0.0006 Å |
b | 11.6706 ± 0.0006 Å |
c | 12.9045 ± 0.0007 Å |
α | 114.425 ± 0.002° |
β | 93.168 ± 0.002° |
γ | 91.062 ± 0.002° |
Cell volume | 1551.67 ± 0.14 Å3 |
Cell temperature | 297 ± 2 K |
Ambient diffraction temperature | 297 ± 2 K |
Number of distinct elements | 6 |
Space group number | 2 |
Hermann-Mauguin space group symbol | P -1 |
Hall space group symbol | -P 1 |
Residual factor for all reflections | 0.0478 |
Residual factor for significantly intense reflections | 0.0463 |
Weighted residual factors for significantly intense reflections | 0.1203 |
Weighted residual factors for all reflections included in the refinement | 0.1215 |
Goodness-of-fit parameter for all reflections included in the refinement | 1.097 |
Diffraction radiation wavelength | 0.71073 Å |
Diffraction radiation type | MoKα |