Information card for entry 7712647
Formula | C47 H64 Al N4 P Se |
Calculated formula | C47 H64 Al N4 P Se |
SMILES | [Se]=P1(N(c2c(cccc2C(C)C)C(C)C)[Al]([N]1=C1N(c2c(cccc2C(C)C)C(C)C)C=CN1c1c(C(C)C)cccc1C(C)C)(C)C)c1ccccc1 |
Title of publication | N^N <i>vs.</i> N^E (E = S or Se) coordination behavior of imino-phosphanamidinate chalcogenide ligands towards aluminum alkyls: efficient hydroboration catalysis of nitriles, alkynes, and alkenes. |
Authors of publication | Karmakar, Himadri; Kumar, Ravi; Sharma, Jyoti; Bag, Jayanta; Pal, Kuntal; Panda, Tarun K.; Chandrasekhar, Vadapalli |
Journal of publication | Dalton transactions (Cambridge, England : 2003) |
Year of publication | 2023 |
a | 10.5605 ± 0.0005 Å |
b | 20.337 ± 0.001 Å |
c | 21.8728 ± 0.0009 Å |
α | 90° |
β | 90° |
γ | 90° |
Cell volume | 4697.6 ± 0.4 Å3 |
Cell temperature | 293 ± 2 K |
Ambient diffraction temperature | 293 ± 2 K |
Number of distinct elements | 6 |
Space group number | 19 |
Hermann-Mauguin space group symbol | P 21 21 21 |
Hall space group symbol | P 2ac 2ab |
Residual factor for all reflections | 0.0818 |
Residual factor for significantly intense reflections | 0.0466 |
Weighted residual factors for significantly intense reflections | 0.0776 |
Weighted residual factors for all reflections included in the refinement | 0.0838 |
Goodness-of-fit parameter for all reflections included in the refinement | 1.015 |
Diffraction radiation wavelength | 0.71073 Å |
Diffraction radiation type | MoKα |