Information card for entry 7712769
Formula |
C18 H34 O4 Zn |
Calculated formula |
C18 H34 O4 Zn |
Title of publication |
Multi-Technique Structural Analysis of Zinc Carboxylates (Soaps) |
Authors of publication |
Wagner, Molly; Pigliapochi, Roberta; DI TULLIO, VALERIA; Catalano, Jaclyn; Zumbulyadis, Nicholas; Centeno, Silvia; Wang, Xiaoling; Chen, Kuizhi; Hung, Ivan; Gan, Zhehong; Dworzak, Michael; Yap, Glenn P. A.; Dybowski, Cecil |
Journal of publication |
Dalton Transactions |
Year of publication |
2023 |
a |
23.001 ± 0.003 Å |
b |
4.6615 ± 0.0007 Å |
c |
9.2225 ± 0.0014 Å |
α |
90° |
β |
95.957 ± 0.003° |
γ |
90° |
Cell volume |
983.5 ± 0.2 Å3 |
Cell temperature |
100 K |
Ambient diffraction temperature |
100 K |
Number of distinct elements |
4 |
Space group number |
7 |
Hermann-Mauguin space group symbol |
P 1 c 1 |
Hall space group symbol |
P -2yc |
Residual factor for all reflections |
0.0483 |
Residual factor for significantly intense reflections |
0.048 |
Weighted residual factors for significantly intense reflections |
0.1357 |
Weighted residual factors for all reflections included in the refinement |
0.1359 |
Goodness-of-fit parameter for all reflections included in the refinement |
1.132 |
Diffraction radiation wavelength |
1.54178 Å |
Diffraction radiation type |
CuKα |
Yes |
No |
No |