Information card for entry 7712876
Formula | C114.29 H90.18 N14.3 O1.8 |
Calculated formula | C114.291 H90.179 N14.2985 O1.7985 |
Title of publication | Bi-directional geometric constraints in the construction of giant dual-rim nanorings |
Authors of publication | Zhong, Wanying; Wang, Zhantao; Yu, Wei-Dong; Wang, Ning; Fu, Fan; Wang, Jun; Zhao, He; Liu, Die; Jiang, Zhilong; Wang, Pingshan; Chen, Mingzhao |
Journal of publication | Dalton Transactions |
Year of publication | 2023 |
a | 15.1349 ± 0.0002 Å |
b | 24.4882 ± 0.0003 Å |
c | 26.4272 ± 0.0003 Å |
α | 66.83 ± 0.001° |
β | 87.714 ± 0.001° |
γ | 88.717 ± 0.001° |
Cell volume | 8997.2 ± 0.2 Å3 |
Cell temperature | 120 ± 0.1 K |
Ambient diffraction temperature | 120 ± 0.1 K |
Number of distinct elements | 4 |
Space group number | 2 |
Hermann-Mauguin space group symbol | P -1 |
Hall space group symbol | -P 1 |
Residual factor for all reflections | 0.132 |
Residual factor for significantly intense reflections | 0.0967 |
Weighted residual factors for significantly intense reflections | 0.2886 |
Weighted residual factors for all reflections included in the refinement | 0.3252 |
Goodness-of-fit parameter for all reflections included in the refinement | 1.222 |
Diffraction radiation probe | x-ray |
Diffraction radiation wavelength | 1.54178 Å |
Diffraction radiation type | CuKα |