Information card for entry 7712989
Formula | C52 H36 Co N8 O |
Calculated formula | C52 H36 Co N8 O |
Title of publication | Cobalt(II) coordination to N4-acenaphthene-based ligand and its sodium complex |
Authors of publication | Khrizanforova, Vera; Fayzullin, Robert R.; Bogomyakov, Artem; Morozov, Vladimir; Batulin, Ruslan Germanovich; Gerasimova, Tatiana; Islamov, Daut; Budnikova, Yulia H. |
Journal of publication | Dalton Transactions |
Year of publication | 2023 |
a | 11.599 ± 0.0002 Å |
b | 23.0619 ± 0.0004 Å |
c | 15.4307 ± 0.0003 Å |
α | 90° |
β | 108.683 ± 0.002° |
γ | 90° |
Cell volume | 3910.13 ± 0.13 Å3 |
Cell temperature | 100 ± 2 K |
Ambient diffraction temperature | 100 ± 2 K |
Number of distinct elements | 5 |
Space group number | 14 |
Hermann-Mauguin space group symbol | P 1 21/c 1 |
Hall space group symbol | -P 2ybc |
Residual factor for all reflections | 0.0429 |
Residual factor for significantly intense reflections | 0.0386 |
Weighted residual factors for significantly intense reflections | 0.1043 |
Weighted residual factors for all reflections included in the refinement | 0.107 |
Goodness-of-fit parameter for all reflections included in the refinement | 1.072 |
Diffraction radiation probe | x-ray |
Diffraction radiation wavelength | 1.54184 Å |
Diffraction radiation type | CuKα |