Information card for entry 7713000
Formula | C51 H76 Cl2 Mg O4 |
Calculated formula | C51 H76 Cl2 Mg O4 |
Title of publication | Simple magnesium alkoxides: synthesis, molecular structure, and catalytic behaviour in the ring-opening polymerization of lactide and macrolactones and for copolymerization of maleic anhydride and propylene oxide |
Authors of publication | Wannipurage, Duleeka; D'Aniello, Sara; Pappalardo, Daniela; Kulathungage, Lakshani Wathsala; Ward, Cassandra L.; Anderson, Danni P.; Groysman, Stanislav; Mazzeo, Mina |
Journal of publication | Dalton Transactions |
Year of publication | 2023 |
a | 12.352 ± 0.006 Å |
b | 13.519 ± 0.006 Å |
c | 15.032 ± 0.007 Å |
α | 67.339 ± 0.013° |
β | 83.2 ± 0.015° |
γ | 82.15 ± 0.014° |
Cell volume | 2288.7 ± 1.9 Å3 |
Cell temperature | 100 K |
Ambient diffraction temperature | 100 K |
Number of distinct elements | 5 |
Space group number | 2 |
Hermann-Mauguin space group symbol | P -1 |
Hall space group symbol | -P 1 |
Residual factor for all reflections | 0.1295 |
Residual factor for significantly intense reflections | 0.083 |
Weighted residual factors for significantly intense reflections | 0.2068 |
Weighted residual factors for all reflections included in the refinement | 0.24 |
Goodness-of-fit parameter for all reflections included in the refinement | 1.045 |
Diffraction radiation wavelength | 0.71073 Å |
Diffraction radiation type | MoKα |