Information card for entry 7713061
Formula | C121 H203 Cr8 F12 N5 O36 Zn2 |
Calculated formula | C121 H203 Cr8 F12 N5 O36 Zn2 |
Title of publication | Synthesis and characterization of heterometallic rings templated through alkylammonium or imidazolium cations. |
Authors of publication | Alotaibi, Rajeh; Booth, Amy; Little, Edmund; Brookfield, Adam; Achari, Amritroop; Lockyer, Selena J.; Timco, Grigore A.; Whitehead, George F. S.; Vitórica-Yrezábal, Iñigo J; Chilton, Nicholas F.; Nair, Rahul R.; Collison, David; Winpenny, Richard E. P. |
Journal of publication | Dalton transactions (Cambridge, England : 2003) |
Year of publication | 2023 |
a | 25.4202 ± 0.0018 Å |
b | 22.009 ± 0.0008 Å |
c | 29.4754 ± 0.0012 Å |
α | 90° |
β | 99.155 ± 0.005° |
γ | 90° |
Cell volume | 16280.6 ± 1.5 Å3 |
Cell temperature | 150 ± 0.1 K |
Ambient diffraction temperature | 150 ± 0.1 K |
Number of distinct elements | 7 |
Space group number | 15 |
Hermann-Mauguin space group symbol | C 1 2/c 1 |
Hall space group symbol | -C 2yc |
Residual factor for all reflections | 0.0848 |
Residual factor for significantly intense reflections | 0.0662 |
Weighted residual factors for significantly intense reflections | 0.2035 |
Weighted residual factors for all reflections included in the refinement | 0.2178 |
Goodness-of-fit parameter for all reflections included in the refinement | 1.061 |
Diffraction radiation probe | x-ray |
Diffraction radiation wavelength | 1.54184 Å |
Diffraction radiation type | CuKα |