Information card for entry 7713141
Formula | C32 H34 N4 O2 Zn |
Calculated formula | C32 H34 N4 O2 Zn |
Title of publication | Al and Zn phenoxy-amidine complexes for lactide ROP catalysis. |
Authors of publication | Théron, Benjamin; Vaillant-Coindard, Valentin; Balan, Cédric; Rousselin, Yoann; Bayardon, Jérôme; Malacea-Kabbara, Raluca; Le Gendre, Pierre |
Journal of publication | Dalton transactions (Cambridge, England : 2003) |
Year of publication | 2023 |
a | 9.5932 ± 0.0007 Å |
b | 12.3033 ± 0.0009 Å |
c | 24.3137 ± 0.0019 Å |
α | 90° |
β | 99.317 ± 0.002° |
γ | 90° |
Cell volume | 2831.8 ± 0.4 Å3 |
Cell temperature | 110 ± 0 K |
Ambient diffraction temperature | 110 ± 0.1 K |
Number of distinct elements | 5 |
Space group number | 15 |
Hermann-Mauguin space group symbol | C 1 2/c 1 |
Hall space group symbol | -C 2yc |
Residual factor for all reflections | 0.0563 |
Residual factor for significantly intense reflections | 0.0385 |
Weighted residual factors for significantly intense reflections | 0.0862 |
Weighted residual factors for all reflections included in the refinement | 0.0929 |
Goodness-of-fit parameter for all reflections included in the refinement | 1.046 |
Diffraction radiation probe | x-ray |
Diffraction radiation wavelength | 0.71073 Å |
Diffraction radiation type | MoKα~1~ |
Diffraction radiation X-ray symbol | K-L~3~ |