Information card for entry 7713194
Common name |
Rb3GaF6 |
Formula |
F6 Ga Rb3 |
Calculated formula |
F6 Ga Rb3 |
Title of publication |
Polymorphism in A3MF6 (A = Rb, Cs; M = Al, Ga) Grown using Mixed Halide Fluxes |
Authors of publication |
Morrison, Gregory; Masachchi, Lakshani W.; Tisdale, Hunter B.; Chang, Tieyan; Jones, Virginia G.; Zamorano, K. Pilar; Breton, Logan S.; Smith, Mark D.; Chen, Yu-Sheng; Zur Loye, Hans-Conrad |
Journal of publication |
Dalton Transactions |
Year of publication |
2023 |
a |
19.7947 ± 0.0004 Å |
b |
19.7947 ± 0.0004 Å |
c |
35.7471 ± 0.0008 Å |
α |
90° |
β |
90° |
γ |
90° |
Cell volume |
14006.8 ± 0.5 Å3 |
Number of distinct elements |
3 |
Space group number |
88 |
Hermann-Mauguin space group symbol |
I 41/a :2 |
Hall space group symbol |
-I 4ad |
Yes |
No |
No |