Information card for entry 7713243
Formula | C119.5 H205.5 Cl16 Mn4 N16 |
Calculated formula | C119.5 H203 Cl16 Mn4 N16 |
Title of publication | A room temperature ferroelectric material with photoluminescence: (1,3-dicyclohexylimidazole)<sub>2</sub>MnCl<sub>4</sub>. |
Authors of publication | Chen, Peng; Jiao, Shulin; Tang, Zheng; Sun, Xiaofan; Li, Dong; Yang, Zhu; Lu, Yanzhou; Zhang, Wentao; Cai, Hong-Ling; Wu, X. S. |
Journal of publication | Dalton transactions (Cambridge, England : 2003) |
Year of publication | 2023 |
a | 16.9646 ± 0.0007 Å |
b | 17.3879 ± 0.0007 Å |
c | 26.959 ± 0.0011 Å |
α | 81.6 ± 0.003° |
β | 78.332 ± 0.003° |
γ | 67.56 ± 0.004° |
Cell volume | 7177.4 ± 0.5 Å3 |
Cell temperature | 293 ± 2 K |
Ambient diffraction temperature | 293 ± 2 K |
Number of distinct elements | 5 |
Space group number | 1 |
Hermann-Mauguin space group symbol | P 1 |
Hall space group symbol | P 1 |
Residual factor for all reflections | 0.1779 |
Residual factor for significantly intense reflections | 0.0964 |
Weighted residual factors for significantly intense reflections | 0.2442 |
Weighted residual factors for all reflections included in the refinement | 0.3102 |
Goodness-of-fit parameter for all reflections included in the refinement | 1.035 |
Diffraction radiation probe | x-ray |
Diffraction radiation wavelength | 0.71073 Å |
Diffraction radiation type | MoKα |