Information card for entry 7713284
Chemical name | 1 |
Formula | C21 H25 Br Cl3 N2 O V |
Calculated formula | C21 H25 Br Cl3 N2 O V |
Title of publication | Vanadium complexes bearing 8-anilide-5,6,7-trihydroquinoline ligands for ethylene (co-)polymerization. |
Authors of publication | Wu, Ruiyao; Niu, Zhen; Xia, Zhu; He, Jianyun; Bai, Chenxi |
Journal of publication | Dalton transactions (Cambridge, England : 2003) |
Year of publication | 2023 |
Journal volume | 52 |
Journal issue | 25 |
Pages of publication | 8636 - 8644 |
a | 35.6823 ± 0.0003 Å |
b | 35.6823 ± 0.0003 Å |
c | 13.3003 ± 0.0002 Å |
α | 90° |
β | 90° |
γ | 120° |
Cell volume | 14665.5 ± 0.3 Å3 |
Cell temperature | 100.01 ± 0.1 K |
Ambient diffraction temperature | 100.01 ± 0.1 K |
Number of distinct elements | 7 |
Space group number | 148 |
Hermann-Mauguin space group symbol | R -3 :H |
Hall space group symbol | -R 3 |
Residual factor for all reflections | 0.0427 |
Residual factor for significantly intense reflections | 0.0379 |
Weighted residual factors for significantly intense reflections | 0.0972 |
Weighted residual factors for all reflections included in the refinement | 0.0996 |
Goodness-of-fit parameter for all reflections included in the refinement | 1.063 |
Diffraction radiation probe | x-ray |
Diffraction radiation wavelength | 1.54184 Å |
Diffraction radiation type | CuKα |