Information card for entry 7713314
Formula | C14 H12 N2 Pt S4 |
Calculated formula | C14 H12 N2 Pt S4 |
Title of publication | A new class of third-order nonlinear optical materials: laser pulse-duration dependant saturable absorption and nonlinear refraction in platinum(II) diimine-dithiolate complexes. |
Authors of publication | Pintus, Anna; Pilloni, Cristian; Pippia, Gabriele; Podda, Enrico; Carla Aragoni, M.; Lippolis, Vito; Aloukos, Panagiotis; Potamianos, Dionysios; Chazapis, Nikolaos; Couris, Stelios; Anyfantis, George C.; Slawin, Alexandra M. Z.; Woollins, J. Derek; Arca, Massimiliano |
Journal of publication | Dalton transactions (Cambridge, England : 2003) |
Year of publication | 2023 |
a | 7.8675 ± 0.0017 Å |
b | 14.825 ± 0.004 Å |
c | 12.827 ± 0.003 Å |
α | 90° |
β | 90° |
γ | 90° |
Cell volume | 1496.1 ± 0.6 Å3 |
Cell temperature | 125 ± 2 K |
Ambient diffraction temperature | 125 K |
Number of distinct elements | 5 |
Space group number | 62 |
Hermann-Mauguin space group symbol | P n m a |
Hall space group symbol | -P 2ac 2n |
Residual factor for all reflections | 0.0254 |
Residual factor for significantly intense reflections | 0.0251 |
Weighted residual factors for significantly intense reflections | 0.0656 |
Weighted residual factors for all reflections included in the refinement | 0.0657 |
Goodness-of-fit parameter for all reflections included in the refinement | 1.131 |
Diffraction radiation wavelength | 0.71075 Å |
Diffraction radiation type | MoKα |