Information card for entry 7713329
Formula | C30 H28 Gd N5 Ni O13.5 S2 |
Calculated formula | C30 H28 Gd N5 Ni O13.5 S2 |
Title of publication | Lanthanoid Coordination Prompts Unusually Distorted Pseudo-Octahedral NiII Coordination in Heterodinuclear Ni-Ln Complexes: Synthesis, Structure and Understanding of Magnetic Behaviour through Experiment and Computation |
Authors of publication | Dutta, Biswarup; Guizouarn, Thierry; Pointillart, Fabrice; Kotrle, Kamil; Herchel, Radovan; Ray, Debashis |
Journal of publication | Dalton Transactions |
Year of publication | 2023 |
a | 9.1623 ± 0.0013 Å |
b | 21.061 ± 0.003 Å |
c | 18.972 ± 0.003 Å |
α | 90° |
β | 92.083 ± 0.011° |
γ | 90° |
Cell volume | 3658.6 ± 0.9 Å3 |
Cell temperature | 296 ± 2 K |
Ambient diffraction temperature | 296.15 K |
Number of distinct elements | 7 |
Space group number | 14 |
Hermann-Mauguin space group symbol | P 1 21/n 1 |
Hall space group symbol | -P 2yn |
Residual factor for all reflections | 0.0251 |
Residual factor for significantly intense reflections | 0.023 |
Weighted residual factors for significantly intense reflections | 0.0697 |
Weighted residual factors for all reflections included in the refinement | 0.0716 |
Goodness-of-fit parameter for all reflections included in the refinement | 1.043 |
Diffraction radiation wavelength | 0.71073 Å |
Diffraction radiation type | MoKα |