Information card for entry 7713394
Formula |
C24 H48 F6 N4 O12 P2 |
Calculated formula |
C24 H48 F6 N4 O12 P2 |
Title of publication |
Transition metal complexes of cyclam with two 2,2,2-trifluoroethylphosphinate pendant arms as probes for <sup>19</sup>F magnetic resonance imaging. |
Authors of publication |
Koucký, Filip; Kotek, Jan; Císařová, Ivana; Havlíčková, Jana; Kubíček, Vojtěch; Hermann, Petr |
Journal of publication |
Dalton transactions (Cambridge, England : 2003) |
Year of publication |
2023 |
a |
8.1091 ± 0.0003 Å |
b |
19.7189 ± 0.0008 Å |
c |
10.8818 ± 0.0005 Å |
α |
90° |
β |
90.755 ± 0.002° |
γ |
90° |
Cell volume |
1739.88 ± 0.12 Å3 |
Cell temperature |
150 ± 2 K |
Ambient diffraction temperature |
150 ± 2 K |
Number of distinct elements |
6 |
Space group number |
14 |
Hermann-Mauguin space group symbol |
P 1 21/c 1 |
Hall space group symbol |
-P 2ybc |
Residual factor for all reflections |
0.0376 |
Residual factor for significantly intense reflections |
0.0317 |
Weighted residual factors for significantly intense reflections |
0.0804 |
Weighted residual factors for all reflections included in the refinement |
0.0842 |
Goodness-of-fit parameter for all reflections included in the refinement |
1.033 |
Diffraction radiation wavelength |
0.71073 Å |
Diffraction radiation type |
MoKα |
Yes |
No |
No |