Information card for entry 7713407
Formula |
C60 H32 Eu3 N6 O16 S3 |
Calculated formula |
C60 H32 Eu3 N6 O16 S3 |
Title of publication |
A highly stable chain-based EuIII metal-organic framework as the turn-on and blue-shift luminescent sensor for dipicolinic acid |
Authors of publication |
Wang, Li; Zhu, Yulian; Zheng, Teng-Fei; Zhu, Zi-Hao; Peng, Yan; Wu, Yongquan; Chen, Jing-Lin; Liu, Sui-Jun; Wen, He-Rui |
Journal of publication |
Dalton Transactions |
Year of publication |
2023 |
a |
8.8463 ± 0.0003 Å |
b |
18.8634 ± 0.0007 Å |
c |
20.8662 ± 0.0007 Å |
α |
113.665 ± 0.001° |
β |
95.571 ± 0.001° |
γ |
102.23 ± 0.001° |
Cell volume |
3051.6 ± 0.19 Å3 |
Cell temperature |
293 ± 2 K |
Ambient diffraction temperature |
293.15 K |
Number of distinct elements |
6 |
Space group number |
2 |
Hermann-Mauguin space group symbol |
P -1 |
Hall space group symbol |
-P 1 |
Residual factor for all reflections |
0.0263 |
Residual factor for significantly intense reflections |
0.0205 |
Weighted residual factors for significantly intense reflections |
0.0457 |
Weighted residual factors for all reflections included in the refinement |
0.0477 |
Goodness-of-fit parameter for all reflections included in the refinement |
1.047 |
Diffraction radiation wavelength |
0.71073 Å |
Diffraction radiation type |
MoKα |
Yes |
Yes |
No |