Information card for entry 7713585
Formula | C43.5 H43 Cl3 O2 P2 Ru |
Calculated formula | C43.5 H43 Cl3 O2 P2 Ru |
Title of publication | Fine-tuning the cytotoxicity of ruthenium(II) arene compounds to enhance selectivity against breast cancers |
Authors of publication | Pereira, Sarah; Romano-deGea, Jan; Barbosa, Ana Isabel; Costa Lima, Sofia A.; Dyson, Paul Joseph; Saraiva, M. Lúcia M.F.S. |
Journal of publication | Dalton Transactions |
Year of publication | 2023 |
a | 10.8812 ± 0.0005 Å |
b | 11.0631 ± 0.0005 Å |
c | 16.8995 ± 0.0008 Å |
α | 74.198 ± 0.004° |
β | 78.406 ± 0.004° |
γ | 82.343 ± 0.004° |
Cell volume | 1910.87 ± 0.16 Å3 |
Cell temperature | 140 ± 0.1 K |
Ambient diffraction temperature | 140 ± 0.1 K |
Number of distinct elements | 6 |
Space group number | 2 |
Hermann-Mauguin space group symbol | P -1 |
Hall space group symbol | -P 1 |
Residual factor for all reflections | 0.0825 |
Residual factor for significantly intense reflections | 0.0725 |
Weighted residual factors for significantly intense reflections | 0.2007 |
Weighted residual factors for all reflections included in the refinement | 0.2149 |
Goodness-of-fit parameter for all reflections included in the refinement | 1.054 |
Diffraction radiation probe | x-ray |
Diffraction radiation wavelength | 1.54184 Å |
Diffraction radiation type | CuKα |