Information card for entry 7713603
Formula |
C59.5 H53 Lu N4 O |
Calculated formula |
C59.5 H53 Lu N4 O |
Title of publication |
Aryl C–H bond functionalization with diphenyldiazomethane induced by rare-earth metal alkyl complexes |
Authors of publication |
Guo, Dianjun; Rajeshkumar, Thayalan; Zhu, Shan; Yuan, Qingbing; Hong, Dongjing; Zhou, Shuangliu; Zhu, Xiancui; Maron, Laurent; Wang, Shaowu |
Journal of publication |
Dalton Transactions |
Year of publication |
2023 |
a |
13.8291 ± 0.0007 Å |
b |
14.0855 ± 0.0007 Å |
c |
14.6541 ± 0.0007 Å |
α |
90.739 ± 0.001° |
β |
107.476 ± 0.001° |
γ |
117.434 ± 0.001° |
Cell volume |
2377.6 ± 0.2 Å3 |
Cell temperature |
293.15 K |
Ambient diffraction temperature |
293.15 K |
Number of distinct elements |
5 |
Space group number |
2 |
Hermann-Mauguin space group symbol |
P -1 |
Hall space group symbol |
-P 1 |
Residual factor for all reflections |
0.0493 |
Residual factor for significantly intense reflections |
0.035 |
Weighted residual factors for significantly intense reflections |
0.0768 |
Weighted residual factors for all reflections included in the refinement |
0.0811 |
Goodness-of-fit parameter for all reflections included in the refinement |
1.022 |
Diffraction radiation wavelength |
0.71073 Å |
Diffraction radiation type |
MoKα |
Yes |
Yes |
No |