Information card for entry 7713648
Formula | C38 H53 As Cl3 F3 O4 S |
Calculated formula | C38 H53 As Cl3 F3 O4 S |
SMILES | [As](O)(c1c(C(C)C)cccc1C(C)C)(c1c(cccc1C(C)C)C(C)C)c1c(cccc1C(C)C)C(C)C.S(=O)(=O)([O-])C(F)(F)F.ClC(Cl)Cl |
Title of publication | Variation in pnictogen-oxygen bonding unlocks greatly enhanced Brønsted basicity for the monomeric stibine oxide. |
Authors of publication | Wenger, John S.; Getahun, Addis; Johnstone, Timothy C. |
Journal of publication | Dalton transactions (Cambridge, England : 2003) |
Year of publication | 2023 |
a | 10.1956 ± 0.0002 Å |
b | 14.2779 ± 0.0002 Å |
c | 14.7095 ± 0.0002 Å |
α | 92.451 ± 0.001° |
β | 101.654 ± 0.001° |
γ | 100.597 ± 0.001° |
Cell volume | 2054.26 ± 0.06 Å3 |
Cell temperature | 101 ± 1 K |
Ambient diffraction temperature | 101 ± 1 K |
Number of distinct elements | 7 |
Space group number | 2 |
Hermann-Mauguin space group symbol | P -1 |
Hall space group symbol | -P 1 |
Residual factor for all reflections | 0.0383 |
Residual factor for significantly intense reflections | 0.0362 |
Weighted residual factors for significantly intense reflections | 0.0942 |
Weighted residual factors for all reflections included in the refinement | 0.0957 |
Goodness-of-fit parameter for all reflections included in the refinement | 1.056 |
Diffraction radiation probe | x-ray |
Diffraction radiation wavelength | 1.54184 Å |
Diffraction radiation type | CuKα |