Information card for entry 7713742
Formula | C59 H48 B2 Cl2 Cu2 F8 N2 P4 Se4 |
Calculated formula | C59 H48 B2 Cl2 Cu2 F8 N2 P4 Se4 |
Title of publication | Dicationic Copper(I) Complexes Bearing ENE (E = S, Se) Pincer Ligands; Catalytic Applications in Regioselective Cyclization of 1,6-diynes |
Authors of publication | Das, Bhagyashree Ms; Sahoo, Amiya Kumar; Banjare, Shyam Kumar; Panda, Subhra Jyoti; Purohit, Chandra Shekhar; Doddi, Adinarayana |
Journal of publication | Dalton Transactions |
Year of publication | 2023 |
a | 14.4083 ± 0.0004 Å |
b | 24.9105 ± 0.0008 Å |
c | 17.3957 ± 0.0006 Å |
α | 90° |
β | 100.231 ± 0.003° |
γ | 90° |
Cell volume | 6144.4 ± 0.3 Å3 |
Cell temperature | 100 ± 0.1 K |
Ambient diffraction temperature | 100 ± 0.1 K |
Number of distinct elements | 9 |
Space group number | 14 |
Hermann-Mauguin space group symbol | P 1 21/n 1 |
Hall space group symbol | -P 2yn |
Residual factor for all reflections | 0.0776 |
Residual factor for significantly intense reflections | 0.0485 |
Weighted residual factors for significantly intense reflections | 0.0935 |
Weighted residual factors for all reflections included in the refinement | 0.1019 |
Goodness-of-fit parameter for all reflections included in the refinement | 1.008 |
Diffraction radiation probe | x-ray |
Diffraction radiation wavelength | 0.71073 Å |
Diffraction radiation type | MoKα |