Information card for entry 7715420
Chemical name | Cu2(L5)2 |
Formula | C178 H217 Cu4 N11 O8 |
Calculated formula | C178 H217 Cu4 N11 O8 |
Title of publication | Nickel, copper, and zinc dinuclear helicates: how do bulky groups influence their architecture? |
Authors of publication | Fernández-Fariña, Sandra; Maneiro, Marcelino; Zaragoza, Guillermo; Seco, José M; Pedrido, Rosa; González-Noya, Ana M |
Journal of publication | Dalton transactions (Cambridge, England : 2003) |
Year of publication | 2024 |
Journal volume | 53 |
Journal issue | 12 |
Pages of publication | 5676 - 5685 |
a | 13.6211 ± 0.0003 Å |
b | 16.0269 ± 0.0004 Å |
c | 18.3522 ± 0.0005 Å |
α | 92.519 ± 0.001° |
β | 97.528 ± 0.001° |
γ | 95.604 ± 0.001° |
Cell volume | 3946.3 ± 0.17 Å3 |
Cell temperature | 100 ± 2 K |
Ambient diffraction temperature | 100 ± 2 K |
Number of distinct elements | 5 |
Space group number | 2 |
Hermann-Mauguin space group symbol | P -1 |
Hall space group symbol | -P 1 |
Residual factor for all reflections | 0.063 |
Residual factor for significantly intense reflections | 0.0453 |
Weighted residual factors for significantly intense reflections | 0.1109 |
Weighted residual factors for all reflections included in the refinement | 0.1211 |
Goodness-of-fit parameter for all reflections included in the refinement | 1.022 |
Diffraction radiation probe | x-ray |
Diffraction radiation wavelength | 0.71073 Å |
Diffraction radiation type | MoKα |