Information card for entry 7715921
Formula | C30 H35 Co4 N5 O12 |
Calculated formula | C29.75 H34.09 Co4 N5 O12 |
Title of publication | Monitoring structure and coordination chemistry of Co<sub>4</sub>O<sub>4</sub>-based oxygen evolution catalysts by nitrogen-14/-15 and cobalt-59 NMR spectroscopy. |
Authors of publication | Uhlig, Felix; Stammler, Michael B.; Meurer, Florian; Shenderovich, Ilya G.; Blahut, Jan; Wisser, Florian M. |
Journal of publication | Dalton transactions (Cambridge, England : 2003) |
Year of publication | 2024 |
Journal volume | 53 |
Journal issue | 20 |
Pages of publication | 8541 - 8545 |
a | 19.6668 ± 0.0002 Å |
b | 13.8232 ± 0.0001 Å |
c | 13.5182 ± 0.0001 Å |
α | 90° |
β | 90° |
γ | 90° |
Cell volume | 3675.03 ± 0.05 Å3 |
Cell temperature | 123 ± 0.1 K |
Ambient diffraction temperature | 123 ± 0.1 K |
Number of distinct elements | 5 |
Space group number | 58 |
Hermann-Mauguin space group symbol | P n n m |
Hall space group symbol | -P 2 2n |
Residual factor for all reflections | 0.0353 |
Residual factor for significantly intense reflections | 0.0322 |
Weighted residual factors for significantly intense reflections | 0.0898 |
Weighted residual factors for all reflections included in the refinement | 0.0918 |
Goodness-of-fit parameter for all reflections included in the refinement | 1.0566 |
Diffraction radiation probe | x-ray |
Diffraction radiation wavelength | 1.54184 Å |
Diffraction radiation type | CuKα |