Information card for entry 7716517
Formula | C20 H25 Cl2 N5 O2 Pd S |
Calculated formula | C20 H25 Cl2 N5 O2 Pd S |
Title of publication | Are the metal identity and stoichiometry of metal complexes important for colchicine site binding and inhibition of tubulin polymerization? |
Authors of publication | Besleaga, Iuliana; Raptová, Renáta; Stoica, Alexandru-Constantin; Milunovic, Miljan N. M.; Zalibera, Michal; Bai, Ruoli; Igaz, Nóra; Reynisson, Jóhannes; Kiricsi, Mónika; Enyedy, Éva A; Rapta, Peter; Hamel, Ernest; Arion, Vladimir B. |
Journal of publication | Dalton transactions (Cambridge, England : 2003) |
Year of publication | 2024 |
Journal volume | 53 |
Journal issue | 29 |
Pages of publication | 12349 - 12369 |
a | 13.9557 ± 0.0012 Å |
b | 15.1993 ± 0.0013 Å |
c | 24.0558 ± 0.0018 Å |
α | 90° |
β | 102.43 ± 0.005° |
γ | 90° |
Cell volume | 4983 ± 0.7 Å3 |
Cell temperature | 100 ± 2 K |
Ambient diffraction temperature | 100 ± 2 K |
Number of distinct elements | 7 |
Space group number | 15 |
Hermann-Mauguin space group symbol | I 1 2/c 1 |
Hall space group symbol | -I 2yc |
Residual factor for all reflections | 0.0694 |
Residual factor for significantly intense reflections | 0.0369 |
Weighted residual factors for significantly intense reflections | 0.0661 |
Weighted residual factors for all reflections included in the refinement | 0.0687 |
Goodness-of-fit parameter for all reflections included in the refinement | 0.854 |
Diffraction radiation wavelength | 0.71073 Å |
Diffraction radiation type | MoKα |