Information card for entry 8103908
Chemical name |
Na3 Sr3 (Ga P4) |
Formula |
Ga Na3 P4 Sr3 |
Calculated formula |
Ga Na3 P4 Sr3 |
SMILES |
[P-2][Ga]([P-2])([P-2])[P-2].[Na+].[Sr+2].[Na+].[Na+].[Sr+2].[Sr+2] |
Title of publication |
Crystal structures of trisodium tristrontium tetrapnictidogallates, Na3 Sr3 Ga P4, Na3 Sr3 Ga As4 and Na3 Sr3 Ga Sb4 |
Authors of publication |
Somer, M.; von Schnering, H.G.; Carillo-Cabrera, W.; Peters, K.; Nuss, J.; Cordier, G. |
Journal of publication |
Zeitschrift fuer Kristallographie (149,1979-) |
Year of publication |
1996 |
Journal volume |
211 |
Pages of publication |
479 - 480 |
a |
9.373 Å |
b |
9.373 Å |
c |
7.371 Å |
α |
90° |
β |
90° |
γ |
120° |
Cell volume |
560.808 Å3 |
Number of distinct elements |
4 |
Space group number |
186 |
Hermann-Mauguin space group symbol |
P 63 m c |
Hall space group symbol |
P 6c -2c |
Yes |
No |
No |