Information card for entry 8103945
Chemical name |
Cr5.20 S8 |
Formula |
Cr5.2 S8 |
Calculated formula |
Cr5.2 S8 |
Title of publication |
The crystal structure of non-stoichiometric monoclinic Cr5+x S8 (x = 0.20 and 0.26) prepared under high pressure and high temperature |
Authors of publication |
Bensch, W.; Luehmann, H.; Naether, C.; Huppertz, H. |
Journal of publication |
Zeitschrift fuer Kristallographie (149,1979-) |
Year of publication |
2002 |
Journal volume |
217 |
Pages of publication |
510 - 514 |
a |
11.7038 Å |
b |
6.7933 Å |
c |
11.0332 Å |
α |
90° |
β |
91.221° |
γ |
90° |
Cell volume |
877.022 Å3 |
Number of distinct elements |
2 |
Space group number |
12 |
Hermann-Mauguin space group symbol |
C 1 2/m 1 (a,b,a+2*c) |
Hall space group symbol |
-C 2y (x-1/2*z,y,1/2*z) |
Yes |
No |
No |