Information card for entry 8104018
Chemical name |
Nd Ba2 Cu2 (Cu.7 Al0.3) O6.7 |
Formula |
Al0.3 Ba2 Cu2.7 Nd O6.7 |
Calculated formula |
Al0.3 Ba2 Cu2.7 Nd O6.7 |
Title of publication |
Crystal structure of barium yttrium-neodymium cuprate, Nd Ba2 Cu2.7 Al0.3 O6.7 |
Authors of publication |
Usov, O.A.; Rozhdestvenskaya, I.V.; Kartenko, N.F.; Konnikov, S.G.; Goloshchapov, S.I.; Nosov, Yu.G.; Osipov, V.N. |
Journal of publication |
Zeitschrift fuer Kristallographie (149,1979-) |
Year of publication |
1994 |
Journal volume |
209 |
Pages of publication |
279 - 279 |
a |
3.914 Å |
b |
3.914 Å |
c |
11.826 Å |
α |
90° |
β |
90° |
γ |
90° |
Cell volume |
181.167 Å3 |
Number of distinct elements |
5 |
Space group number |
123 |
Hermann-Mauguin space group symbol |
P 4/m m m |
Hall space group symbol |
-P 4 2 |
Yes |
No |
No |