Information card for entry 8104023
Formula
Pt2 Te3
Calculated formula
Pt2 Te3
Title of publication
Overlooked trigonal symmetry in structures reported with monoclinic centered Bravais lattices; trigonal description of Li8 Pb3, Pt Te, Pt3 Te4, Pt2 Te3, Li Fe6 Ge4, Li Fe6 Ge5, Ca Ga6 Te10 and La3.266 Mn1.1 S6
Authors of publication
Cenzual, K.; Parthe, E.; Gelato, M.N.; Penzo, M.
Journal of publication
Zeitschrift fuer Kristallographie (149,1979-)
Year of publication
1990
Journal volume
193
Pages of publication
217 - 242
a
4.003 Å
b
4.003 Å
c
50.89 Å
α
90°
β
90°
γ
120°
Cell volume
706.211 Å3
Number of distinct elements
2
Space group number
166
Hermann-Mauguin space group symbol
R -3 m :H
Hall space group symbol
-R 3 2"
Yes
No
No