Information card for entry 8104029
Chemical name
Li Fe6 Ge4
Formula
Fe6 Ge4 Li
Calculated formula
Fe6 Ge4 Li
Title of publication
Overlooked trigonal symmetry in structures reported with monoclinic centered Bravais lattices; trigonal description of Li8 Pb3, Pt Te, Pt3 Te4, Pt2 Te3, Li Fe6 Ge4, Li Fe6 Ge5, Ca Ga6 Te10 and La3.266 Mn1.1 S6
Authors of publication
Cenzual, K.; Gelato, M.N.; Penzo, M.; Parthe, E.
Journal of publication
Zeitschrift fuer Kristallographie (149,1979-)
Year of publication
1990
Journal volume
193
Pages of publication
217 - 242
a
5.045 Å
b
5.045 Å
c
19.66 Å
α
90°
β
90°
γ
120°
Cell volume
433.348 Å3
Number of distinct elements
3
Space group number
166
Hermann-Mauguin space group symbol
R -3 m :H
Hall space group symbol
-R 3 2"
Yes
No
No